Reaction Details
TargetAurora kinase B
LigandBDBM50335191
Substrate/Competitorn/a
Meas. Tech.ChEMBL_701675 (CHEMBL1656567)
IC50 76±n/a nM
Citation Kerekes, ADEsposite, SJTagat, JRXiao, YTerracina, GA Aurora kinase inhibitors based on the imidazo[1,2-a]pyrazine core: fluorine and deuterium incorporation improve oral absorption and exposure. J Med Chem54:201-10 (2011) 
 
Aurora kinase B
Name:Aurora kinase B
Type:Protein
Mol. Mass.:39327.72
Organism:Homo sapiens (Human)
Description:Q96GD4
Residue:344
BDBM50335191
NameBDBM50335191
Synonyms:CHEMBL1650548 | N-[3-[(3,3-Difluoro-1-azetidinyl)methyl]-5-isothiazolyl]-6-methyl-3-(1H-pyrazol-4-yl)imidazo[1,2-a]pyrazin-8-amine Trifluoroacetate
TypeSmall organic molecule
Emp. Form.C17H16F2N8S
Mol. Mass.402.424
SMILESCc1cn2c(cnc2c(Nc2cc(CN3CC(F)(F)C3)ns2)n1)-c1cn[nH]c1