Reaction Details
TargetAurora kinase B
LigandBDBM50335189
Substrate/Competitorn/a
Meas. Tech.ChEMBL_701675 (CHEMBL1656567)
IC50 50±n/a nM
Citation Kerekes, ADEsposite, SJTagat, JRXiao, YTerracina, GA Aurora kinase inhibitors based on the imidazo[1,2-a]pyrazine core: fluorine and deuterium incorporation improve oral absorption and exposure. J Med Chem54:201-10 (2011) 
 
Aurora kinase B
Name:Aurora kinase B
Type:Protein
Mol. Mass.:39327.72
Organism:Homo sapiens (Human)
Description:Q96GD4
Residue:344
BDBM50335189
NameBDBM50335189
Synonyms:6-Methyl-3-(1H-pyrazol-4-yl)-N-[3-[(3,3,4,4-tetrafluoro-1-pyrrolidinyl)methyl]-5-isothiazolyl]imidazo[1,2-a]pyrazin-8-amine Hydrochloride | CHEMBL1650546
TypeSmall organic molecule
Emp. Form.C18H16F4N8S
Mol. Mass.452.432
SMILESCc1cn2c(cnc2c(Nc2cc(CN3CC(F)(F)C(F)(F)C3)ns2)n1)-c1cn[nH]c1