Reaction Details
TargetAurora kinase B
LigandBDBM50335181
Substrate/Competitorn/a
Meas. Tech.ChEMBL_701675 (CHEMBL1656567)
IC50 74±n/a nM
Citation Kerekes, ADEsposite, SJTagat, JRXiao, YTerracina, GA Aurora kinase inhibitors based on the imidazo[1,2-a]pyrazine core: fluorine and deuterium incorporation improve oral absorption and exposure. J Med Chem54:201-10 (2011) 
 
Aurora kinase B
Name:Aurora kinase B
Type:Protein
Mol. Mass.:39327.72
Organism:Homo sapiens (Human)
Description:Q96GD4
Residue:344
BDBM50335181
NameBDBM50335181
Synonyms:CHEMBL1650538 | N-[3-[(4,4-Difluoro-1-piperidinyl)methyl]-5-isothiazolyl]-6-methyl-3-(1H-pyrazol-4-yl)imidazo[1,2-a]pyrazin-8-amine Hydrochloride
TypeSmall organic molecule
Emp. Form.C19H20F2N8S
Mol. Mass.430.478
SMILESCc1cn2c(cnc2c(Nc2cc(CN3CCC(F)(F)CC3)ns2)n1)-c1cn[nH]c1