Reaction Details
TargetCyclin-dependent kinase 2
LigandBDBM50329198
Substrate/Competitorn/a
Meas. Tech.ChEMBL_701559 (CHEMBL1656198)
IC50>100±n/a nM
Citation Kerekes, ADEsposite, SJTagat, JRXiao, YTerracina, GA Aurora kinase inhibitors based on the imidazo[1,2-a]pyrazine core: fluorine and deuterium incorporation improve oral absorption and exposure. J Med Chem54:201-10 (2011) 
 
Cyclin-dependent kinase 2
Name:Cyclin-dependent kinase 2
Type:Enzyme Subunit
Mol. Mass.:33938.17
Organism:Homo sapiens (Human)
Description:P24941
Residue:298
BDBM50329198
NameBDBM50329198
Synonyms:2-(ethyl((5-(6-methyl-3-(1H-pyrazol-4-yl)imidazo[1,2-a]pyrazin-8-ylamino)isothiazol-3-yl)methyl)amino)-2-methylpropan-1-ol CHEMBL1232515 | CHEMBL1650533
TypeSmall organic molecule
Emp. Form.C20H26N8OS
Mol. Mass.426.538
SMILESCCN(Cc1cc(Nc2nc(C)cn3c(cnc23)-c2cn[nH]c2)sn1)C(C)(C)CO