Reaction Details
TargetInhibitor of nuclear factor kappa-B kinase subunit beta
LigandBDBM50329198
Substrate/Competitorn/a
Meas. Tech.ChEMBL_701554 (CHEMBL1656193)
IC50>100±n/a nM
Citation Kerekes, ADEsposite, SJTagat, JRXiao, YTerracina, GA Aurora kinase inhibitors based on the imidazo[1,2-a]pyrazine core: fluorine and deuterium incorporation improve oral absorption and exposure. J Med Chem54:201-10 (2011) 
 
Inhibitor of nuclear factor kappa-B kinase subunit beta
Name:Inhibitor of nuclear factor kappa-B kinase subunit beta
Type:Serine/threonine-protein kinase
Mol. Mass.:86554.39
Organism:Homo sapiens (Human)
Description:GST-tagged IKK-2 was expressed in High Five cells and purified.
Residue:756
BDBM50329198
NameBDBM50329198
Synonyms:2-(ethyl((5-(6-methyl-3-(1H-pyrazol-4-yl)imidazo[1,2-a]pyrazin-8-ylamino)isothiazol-3-yl)methyl)amino)-2-methylpropan-1-ol CHEMBL1232515 | CHEMBL1650533
TypeSmall organic molecule
Emp. Form.C20H26N8OS
Mol. Mass.426.538
SMILESCCN(Cc1cc(Nc2nc(C)cn3c(cnc23)-c2cn[nH]c2)sn1)C(C)(C)CO