Reaction Details
TargetCathepsin S
LigandBDBM50335282
Substrate/Competitorn/a
Meas. Tech.ChEMBL_702783 (CHEMBL1655226)
Ki 0.17±n/a nM
Citation Frizler, MLohr, FFurtmann, NKläs, JGütschow, M Structural optimization of azadipeptide nitriles strongly increases association rates and allows the development of selective cathepsin inhibitors. J Med Chem54:396-400 (2011) 
 
Cathepsin S
Name:Cathepsin S
Type:Protein
Mol. Mass.:37507.38
Organism:Homo sapiens (Human)
Description:P25774
Residue:331
BDBM50335282
NameBDBM50335282
Synonyms:CHEMBL1651356 acs.jmedchem.1c00409_ST.405
TypeSmall organic molecule
Emp. Form.C20H27N7O3
Mol. Mass.413.4735
SMILESCC(C)C[C@H](NC(=O)NCc1ccc(cc1)-c1noc(C)n1)C(=O)N(C)N(C)C#N