Reaction Details
TargetCathepsin K
LigandBDBM50304793
Substrate/Competitorn/a
Meas. Tech.ChEMBL_702784 (CHEMBL1655227)
Ki 0.14±n/a nM
Citation Frizler, MLohr, FFurtmann, NKläs, JGütschow, M Structural optimization of azadipeptide nitriles strongly increases association rates and allows the development of selective cathepsin inhibitors. J Med Chem54:396-400 (2011) 
 
Cathepsin K
Name:Cathepsin K
Type:Enzyme
Mol. Mass.:36975.68
Organism:Homo sapiens (Human)
Description:P43235
Residue:329
BDBM50304793
NameBDBM50304793
Synonyms:(S)-benzyl 1-(2-cyano-1,2-dimethylhydrazinyl)-1-oxo-3-phenylpropan-2-ylcarbamate acs.jmedchem.1c00409_ST.400
TypeSmall organic molecule
Emp. Form.C20H22N4O3
Mol. Mass.366.4137
SMILESCN(C#N)N(C)C(=O)[C@H](Cc1ccccc1)NC(=O)OCc1ccccc1