Reaction Details
TargetCytochrome P450 3A4
LigandBDBM50336715
Substrate/Competitorn/a
Meas. Tech.ChEMBL_718215 (CHEMBL1679409)
IC50>40000±n/a nM
Citation Sams, AGMikkelsen, GKLarsen, MLanggård, MHowells, MESchrøder, TJBrennum, LTTorup, LJørgensen, EBBundgaard, CKreilgård, MBang-Andersen, B Discovery of phosphoric acid mono-{2-[(E/Z)-4-(3,3-dimethyl-butyrylamino)-3,5-difluoro-benzoylimino]-thiazol-3-ylmethyl} ester (Lu AA47070): a phosphonooxymethylene prodrug of a potent and selective hA(2A) receptor antagonist. J Med Chem54:751-64 (2012) 
 
Cytochrome P450 3A4
Name:Cytochrome P450 3A4
Type:Enzyme
Mol. Mass.:57349.57
Organism:Homo sapiens (Human)
Description:n/a
Residue:503
BDBM50336715
NameBDBM50336715
Synonyms:4-(3,3-Dimethyl-butyrylamino)-3,5-difluoro-N-thiazol-2-yl-benzamide | CHEMBL1671936
TypeSmall organic molecule
Emp. Form.C16H17F2N3O2S
Mol. Mass.353.387
SMILESCC(C)(C)CC(=O)Nc1c(F)cc(cc1F)C(=O)Nc1nccs1