Reaction Details
TargetCytochrome P450 2C19
LigandBDBM50336716
Substrate/Competitorn/a
Meas. Tech.ChEMBL_718213 (CHEMBL1679259)
IC50 36000±n/a nM
Citation Sams, AGMikkelsen, GKLarsen, MLanggård, MHowells, MESchrøder, TJBrennum, LTTorup, LJørgensen, EBBundgaard, CKreilgård, MBang-Andersen, B Discovery of phosphoric acid mono-{2-[(E/Z)-4-(3,3-dimethyl-butyrylamino)-3,5-difluoro-benzoylimino]-thiazol-3-ylmethyl} ester (Lu AA47070): a phosphonooxymethylene prodrug of a potent and selective hA(2A) receptor antagonist. J Med Chem54:751-64 (2012) 
 
Cytochrome P450 2C19
Name:Cytochrome P450 2C19
Type:Enzyme
Mol. Mass.:55935.47
Organism:Homo sapiens (Human)
Description:P33261
Residue:490
BDBM50336716
NameBDBM50336716
Synonyms:4-Butyrylamino-N-thiazol-2-yl-benzamide | CHEMBL1671918
TypeSmall organic molecule
Emp. Form.C14H15N3O2S
Mol. Mass.289.353
SMILESCCCC(=O)Nc1ccc(cc1)C(=O)Nc1nccs1