Reaction Details
TargetCytochrome P450 3A4
LigandBDBM50336722
Substrate/Competitorn/a
Meas. Tech.ChEMBL_718215 (CHEMBL1679409)
IC50 1400±n/a nM
Citation Sams, AGMikkelsen, GKLarsen, MLanggård, MHowells, MESchrøder, TJBrennum, LTTorup, LJørgensen, EBBundgaard, CKreilgård, MBang-Andersen, B Discovery of phosphoric acid mono-{2-[(E/Z)-4-(3,3-dimethyl-butyrylamino)-3,5-difluoro-benzoylimino]-thiazol-3-ylmethyl} ester (Lu AA47070): a phosphonooxymethylene prodrug of a potent and selective hA(2A) receptor antagonist. J Med Chem54:751-64 (2012) 
 
Cytochrome P450 3A4
Name:Cytochrome P450 3A4
Type:Enzyme
Mol. Mass.:57349.57
Organism:Homo sapiens (Human)
Description:n/a
Residue:503
BDBM50336722
NameBDBM50336722
Synonyms:2-methyl-N-(4-(thiazol-2-ylcarbamoyl)phenyl)benzamide | CHEMBL1671916
TypeSmall organic molecule
Emp. Form.C18H15N3O2S
Mol. Mass.337.396
SMILESCc1ccccc1C(=O)Nc1ccc(cc1)C(=O)Nc1nccs1