Reaction Details
TargetAdenosine receptor A2a
LigandBDBM50336717
Substrate/Competitorn/a
Meas. Tech.ChEMBL_718204 (CHEMBL1679250)
Ki 17±n/a nM
Citation Sams, AGMikkelsen, GKLarsen, MLanggård, MHowells, MESchrøder, TJBrennum, LTTorup, LJørgensen, EBBundgaard, CKreilgård, MBang-Andersen, B Discovery of phosphoric acid mono-{2-[(E/Z)-4-(3,3-dimethyl-butyrylamino)-3,5-difluoro-benzoylimino]-thiazol-3-ylmethyl} ester (Lu AA47070): a phosphonooxymethylene prodrug of a potent and selective hA(2A) receptor antagonist. J Med Chem54:751-64 (2012) 
 
Adenosine receptor A2a
Name:Adenosine receptor A2a
Type:G Protein-Coupled Receptor (GPCR)
Mol. Mass.:44716.46
Organism:Homo sapiens (Human)
Description:P29274
Residue:412
BDBM50336717
NameBDBM50336717
Synonyms:4-(3,3-Dimethyl-butyrylamino)-3-methoxy-N-thiazol-2-yl-benzamide | CHEMBL1671932
TypeSmall organic molecule
Emp. Form.C17H21N3O3S
Mol. Mass.347.432
SMILESCOc1cc(ccc1NC(=O)CC(C)(C)C)C(=O)Nc1nccs1