Reaction Details
TargetCytochrome P450 2D6
LigandBDBM50336725
Substrate/Competitorn/a
Meas. Tech.ChEMBL_718214 (CHEMBL1679408)
IC50>40000±n/a nM
Citation Sams, AGMikkelsen, GKLarsen, MLanggård, MHowells, MESchrøder, TJBrennum, LTTorup, LJørgensen, EBBundgaard, CKreilgård, MBang-Andersen, B Discovery of phosphoric acid mono-{2-[(E/Z)-4-(3,3-dimethyl-butyrylamino)-3,5-difluoro-benzoylimino]-thiazol-3-ylmethyl} ester (Lu AA47070): a phosphonooxymethylene prodrug of a potent and selective hA(2A) receptor antagonist. J Med Chem54:751-64 (2012) 
 
Cytochrome P450 2D6
Name:Cytochrome P450 2D6
Type:Protein
Mol. Mass.:55774.82
Organism:Homo sapiens (Human)
Description:P10635
Residue:497
BDBM50336725
NameBDBM50336725
Synonyms:4-pentanamido-N-(thiazol-2-yl)benzamide | CHEMBL1671917
TypeSmall organic molecule
Emp. Form.C15H17N3O2S
Mol. Mass.303.379
SMILESCCCCC(=O)Nc1ccc(cc1)C(=O)Nc1nccs1