Reaction Details
TargetCytochrome P450 1A2
LigandBDBM50336728
Substrate/Competitorn/a
Meas. Tech.ChEMBL_718211 (CHEMBL1679257)
IC50>40000±n/a nM
Citation Sams, AGMikkelsen, GKLarsen, MLanggård, MHowells, MESchrøder, TJBrennum, LTTorup, LJørgensen, EBBundgaard, CKreilgård, MBang-Andersen, B Discovery of phosphoric acid mono-{2-[(E/Z)-4-(3,3-dimethyl-butyrylamino)-3,5-difluoro-benzoylimino]-thiazol-3-ylmethyl} ester (Lu AA47070): a phosphonooxymethylene prodrug of a potent and selective hA(2A) receptor antagonist. J Med Chem54:751-64 (2012) 
 
Cytochrome P450 1A2
Name:Cytochrome P450 1A2
Type:Enzyme
Mol. Mass.:58423.38
Organism:Homo sapiens (Human)
Description:P05177
Residue:516
BDBM50336728
NameBDBM50336728
Synonyms:4-(3-Methyl-butyrylamino)-N-thiazol-2-yl-benzamide | CHEMBL1671921
TypeSmall organic molecule
Emp. Form.C15H17N3O2S
Mol. Mass.303.379
SMILESCC(C)CC(=O)Nc1ccc(cc1)C(=O)Nc1nccs1