Reaction Details
TargetAdenosine receptor A1
LigandBDBM50336709
Substrate/Competitorn/a
Meas. Tech.ChEMBL_718205 (CHEMBL1679251)
Ki 1100±n/a nM
Citation Sams, AGMikkelsen, GKLarsen, MLanggård, MHowells, MESchrøder, TJBrennum, LTTorup, LJørgensen, EBBundgaard, CKreilgård, MBang-Andersen, B Discovery of phosphoric acid mono-{2-[(E/Z)-4-(3,3-dimethyl-butyrylamino)-3,5-difluoro-benzoylimino]-thiazol-3-ylmethyl} ester (Lu AA47070): a phosphonooxymethylene prodrug of a potent and selective hA(2A) receptor antagonist. J Med Chem54:751-64 (2012) 
 
Adenosine receptor A1
Name:Adenosine receptor A1
Type:G Protein-Coupled Receptor (GPCR)
Mol. Mass.:36520.92
Organism:Homo sapiens (Human)
Description:P30542
Residue:326
BDBM50336709
NameBDBM50336709
Synonyms:4-(3,3-Dimethyl-butyrylamino)-2-methoxy-N-thiazol-2-yl-benzamide | CHEMBL1671929
TypeSmall organic molecule
Emp. Form.C17H21N3O3S
Mol. Mass.347.432
SMILESCOc1cc(NC(=O)CC(C)(C)C)ccc1C(=O)Nc1nccs1