Reaction Details
TargetP2Y purinoceptor 2
LigandBDBM50336768
Substrate/Competitorn/a
Meas. Tech.ChEMBL_718668 (CHEMBL1680819)
IC50 10000±n/a nM
Citation Baqi, YHausmann, RRosefort, CRettinger, JSchmalzing, GMüller, CE Discovery of potent competitive antagonists and positive modulators of the P2X2 receptor. J Med Chem54:817-30 (2012) 
 
P2Y purinoceptor 2
Name:P2Y purinoceptor 2
Type:PROTEIN
Mol. Mass.:42299.21
Organism:Homo sapiens (Human)
Description:ChEMBL_1455361
Residue:377
BDBM50336768
NameBDBM50336768
Synonyms:CHEMBL1671995 | sodium 1-amino-4-(3-methoxyphenylamino)-9,10-dioxo-9,10-dihydroanthracene-2-sulfonate
TypeSmall organic molecule
Emp. Form.C21H15N2O6S
Mol. Mass.423.419
SMILESCOc1cccc(Nc2cc(c(N)c3C(=O)c4ccccc4C(=O)c23)S([O-])(=O)=O)c1