Reaction Details
TargetP2Y purinoceptor 4
LigandBDBM50336796
Substrate/Competitorn/a
Meas. Tech.ChEMBL_718669 (CHEMBL1680820)
IC50 10000±n/a nM
Citation Baqi, YHausmann, RRosefort, CRettinger, JSchmalzing, GMüller, CE Discovery of potent competitive antagonists and positive modulators of the P2X2 receptor. J Med Chem54:817-30 (2012) 
 
P2Y purinoceptor 4
Name:P2Y purinoceptor 4
Type:PROTEIN
Mol. Mass.:40977.17
Organism:Homo sapiens (Human)
Description:ChEMBL_751027
Residue:365
BDBM50336796
NameBDBM50336796
Synonyms:CHEMBL1672105 | Sodium 1-Amino-4-[3-(4,6-dichloro[1,3,5]triazine-2-ylamino)-phenylamino]-9,10-dioxo-9,10-dihydroanthracene-2-sulfonate
TypeSmall organic molecule
Emp. Form.C23H13Cl2N6O5S
Mol. Mass.556.358
SMILESNc1c(cc(Nc2cccc(Nc3nc(Cl)nc(Cl)n3)c2)c2C(=O)c3ccccc3C(=O)c12)S([O-])(=O)=O