Reaction Details
TargetP2Y purinoceptor 4
LigandBDBM50268876
Substrate/Competitorn/a
Meas. Tech.ChEMBL_718669 (CHEMBL1680820)
IC50>10000±n/a nM
Citation Baqi, YHausmann, RRosefort, CRettinger, JSchmalzing, GMüller, CE Discovery of potent competitive antagonists and positive modulators of the P2X2 receptor. J Med Chem54:817-30 (2012) 
 
P2Y purinoceptor 4
Name:P2Y purinoceptor 4
Type:PROTEIN
Mol. Mass.:40977.17
Organism:Homo sapiens (Human)
Description:ChEMBL_751027
Residue:365
BDBM50268876
NameBDBM50268876
Synonyms:CHEMBL509572 | Disodium 1-amino-4-[4-(4-chloro-6-methoxy-[1,3,5]triazine-2-ylamino)-3-sulfophenylamino]-9,10-dioxo-9,10-dihydroanthracene-2-sulfonate
TypeSmall organic molecule
Emp. Form.C24H15ClN6O9S2
Mol. Mass.630.995
SMILESCOc1nc(Cl)nc(Nc2ccc(Nc3cc(c(N)c4C(=O)c5ccccc5C(=O)c34)S([O-])(=O)=O)cc2S([O-])(=O)=O)n1