Reaction Details
TargetP2X purinoceptor 1
LigandBDBM50336781
Substrate/Competitorn/a
Meas. Tech.ChEMBL_718659 (CHEMBL1680810)
IC50 422±n/a nM
Citation Baqi, YHausmann, RRosefort, CRettinger, JSchmalzing, GMüller, CE Discovery of potent competitive antagonists and positive modulators of the P2X2 receptor. J Med Chem54:817-30 (2012) 
 
P2X purinoceptor 1
Name:P2X purinoceptor 1
Type:Enzyme Catalytic Domain
Mol. Mass.:44969.95
Organism:RAT
Description:Purinergic, P2X1 0 RAT::P47824
Residue:399
BDBM50336781
NameBDBM50336781
Synonyms:CHEMBL1672104 | Disodium 1-Amino-4-[3-(4,6-dichloro[1,3,5]triazine-2-ylamino)-4-sulfophenylamino]-9,10-dioxo-9,10-dihydroanthracene-2-sulfonate
TypeSmall organic molecule
Emp. Form.C23H12Cl2N6O8S2
Mol. Mass.635.414
SMILESNc1c(cc(Nc2ccc(c(Nc3nc(Cl)nc(Cl)n3)c2)S([O-])(=O)=O)c2C(=O)c3ccccc3C(=O)c12)S([O-])(=O)=O