Reaction Details
TargetP2X purinoceptor 2
LigandBDBM50268574
Substrate/Competitorn/a
Meas. Tech.ChEMBL_718656 (CHEMBL1680807)
IC50>10000±n/a nM
Citation Baqi, YHausmann, RRosefort, CRettinger, JSchmalzing, GMüller, CE Discovery of potent competitive antagonists and positive modulators of the P2X2 receptor. J Med Chem54:817-30 (2012) 
 
P2X purinoceptor 2
Name:P2X purinoceptor 2
Type:Enzyme Catalytic Domain
Mol. Mass.:52625.55
Organism:RAT
Description:Purinergic, P2X2 0 RAT::P49653
Residue:472
BDBM50268574
NameBDBM50268574
Synonyms:CHEMBL498423 Sodium 1-amino-4-[1-naphthylamino]-9,10-dioxo-9,10 dihydroanthracene-2-sulfonate
TypeSmall organic molecule
Emp. Form.C24H15N2O5S
Mol. Mass.443.452
SMILESNc1c2C(=O)c3ccccc3C(=O)c2c(Nc2cccc3ccccc23)cc1S([O-])(=O)=O