Reaction Details
TargetP2Y purinoceptor 12
LigandBDBM50227032
Substrate/Competitorn/a
Meas. Tech.ChEMBL_718672 (CHEMBL1680823)
Ki 9830±n/a nM
Citation Baqi, YHausmann, RRosefort, CRettinger, JSchmalzing, GMüller, CE Discovery of potent competitive antagonists and positive modulators of the P2X2 receptor. J Med Chem54:817-30 (2012) 
 
P2Y purinoceptor 12
Name:P2Y purinoceptor 12
Type:Enzyme
Mol. Mass.:39458.48
Organism:Homo sapiens (Human)
Description:Q9H244
Residue:342
BDBM50227032
NameBDBM50227032
Synonyms:CHEMBL256057 sodium 1-amino-9,10-dioxo-4-(phenylamino)-9,10-dihydroanthracene-2-sulfonate
TypeSmall organic molecule
Emp. Form.C20H13N2O5S
Mol. Mass.393.393
SMILESNc1c2C(=O)c3ccccc3C(=O)c2c(Nc2ccccc2)cc1S([O-])(=O)=O