Reaction Details
TargetP2Y purinoceptor 12
LigandBDBM50268875
Substrate/Competitorn/a
Meas. Tech.ChEMBL_718672 (CHEMBL1680823)
Ki 1900±n/a nM
Citation Baqi, YHausmann, RRosefort, CRettinger, JSchmalzing, GMüller, CE Discovery of potent competitive antagonists and positive modulators of the P2X2 receptor. J Med Chem54:817-30 (2012) 
 
P2Y purinoceptor 12
Name:P2Y purinoceptor 12
Type:Enzyme
Mol. Mass.:39458.48
Organism:Homo sapiens (Human)
Description:Q9H244
Residue:342
BDBM50268875
NameBDBM50268875
Synonyms:CHEMBL496401 | Sodium 1-amino-4-[4-(4,6-dichloro-[1,3,5]triazine-2-ylamino)-phenylamino]-9,10-dioxo-9,10-dihydroanthracene-2-sulfonate
TypeSmall organic molecule
Emp. Form.C23H13Cl2N6O5S
Mol. Mass.556.358
SMILESNc1c(cc(Nc2ccc(Nc3nc(Cl)nc(Cl)n3)cc2)c2C(=O)c3ccccc3C(=O)c12)S([O-])(=O)=O