Reaction Details
TargetHistone deacetylase 4
LigandBDBM50015142
Substrate/Competitorn/a
Meas. Tech.ChEMBL_718472 (CHEMBL1680136)
IC50 140000±n/a nM
Citation Fass, DMShah, RGhosh, BHennig, KNorton, SZhao, WNReis, SAKlein, PSMazitschek, RMaglathlin, RLLewis, TAHaggarty, SJ Effect of Inhibiting Histone Deacetylase with Short-Chain Carboxylic Acids and Their Hydroxamic Acid Analogs on Vertebrate Development and Neuronal Chromatin. ACS Med Chem Lett2:39-42 (2011) 
 
Histone deacetylase 4
Name:Histone deacetylase 4
Type:Enzyme
Mol. Mass.:119049.39
Organism:Homo sapiens (Human)
Description:P56524
Residue:1084
BDBM50015142
NameBDBM50015142
Synonyms:4-Phenylbutyrohydroxamic acid N-Hydroxy-4-phenyl-butyramide
TypeSmall organic molecule
Emp. Form.C10H13NO2
Mol. Mass.179.2157
SMILESONC(=O)CCCc1ccccc1