Reaction Details
TargetHistone deacetylase 5
LigandBDBM50003616
Substrate/Competitorn/a
Meas. Tech.ChEMBL_718473 (CHEMBL1680137)
IC50>2000000±n/a nM
Citation Fass, DMShah, RGhosh, BHennig, KNorton, SZhao, WNReis, SAKlein, PSMazitschek, RMaglathlin, RLLewis, TAHaggarty, SJ Effect of Inhibiting Histone Deacetylase with Short-Chain Carboxylic Acids and Their Hydroxamic Acid Analogs on Vertebrate Development and Neuronal Chromatin. ACS Med Chem Lett2:39-42 (2011) 
 
Histone deacetylase 5
Name:Histone deacetylase 5
Type:Enzyme
Mol. Mass.:121968.61
Organism:Homo sapiens (Human)
Description:Q9UQL6
Residue:1122
BDBM50003616
NameBDBM50003616
Synonyms:2-n-propyl-n-valeric acid DPA VALPROIC ACID dipropylacetic acid | n-DPA
TypeSmall organic molecule
Emp. Form.C8H16O2
Mol. Mass.144.2114
SMILESCCCC(CCC)C(O)=O