Reaction Details
TargetHistone deacetylase 6
LigandBDBM50003616
Substrate/Competitorn/a
Meas. Tech.ChEMBL_718476 (CHEMBL1680140)
IC50>2000000±n/a nM
Citation Fass, DMShah, RGhosh, BHennig, KNorton, SZhao, WNReis, SAKlein, PSMazitschek, RMaglathlin, RLLewis, TAHaggarty, SJ Effect of Inhibiting Histone Deacetylase with Short-Chain Carboxylic Acids and Their Hydroxamic Acid Analogs on Vertebrate Development and Neuronal Chromatin. ACS Med Chem Lett2:39-42 (2011) 
 
Histone deacetylase 6
Name:Histone deacetylase 6
Type:Chromatin regulator; hydrolase; repressor
Mol. Mass.:131381.51
Organism:Homo sapiens (Human)
Description:Q9UBN7
Residue:1215
BDBM50003616
NameBDBM50003616
Synonyms:2-n-propyl-n-valeric acid DPA VALPROIC ACID dipropylacetic acid | n-DPA
TypeSmall organic molecule
Emp. Form.C8H16O2
Mol. Mass.144.2114
SMILESCCCC(CCC)C(O)=O