Reaction Details
TargetHistone deacetylase 9
LigandBDBM50336884
Substrate/Competitorn/a
Meas. Tech.ChEMBL_718475 (CHEMBL1680139)
IC50 91000±n/a nM
Citation Fass, DMShah, RGhosh, BHennig, KNorton, SZhao, WNReis, SAKlein, PSMazitschek, RMaglathlin, RLLewis, TAHaggarty, SJ Effect of Inhibiting Histone Deacetylase with Short-Chain Carboxylic Acids and Their Hydroxamic Acid Analogs on Vertebrate Development and Neuronal Chromatin. ACS Med Chem Lett2:39-42 (2011) 
 
Histone deacetylase 9
Name:Histone deacetylase 9
Type:Enzyme
Mol. Mass.:111304.31
Organism:Homo sapiens (Human)
Description:Q9UKV0
Residue:1011
BDBM50336884
NameBDBM50336884
Synonyms:2-Propyl-pentanoic acid hydroxyamide Valpropylhydroxamic acid
TypeSmall organic molecule
Emp. Form.C8H17NO2
Mol. Mass.159.2261
SMILESCCCC(CCC)C(=O)NO