Reaction Details
TargetRAF proto-oncogene serine/threonine-protein kinase
LigandBDBM50338874
Substrate/Competitorn/a
Meas. Tech.ChEMBL_727230 (CHEMBL1687324)
IC50 22.41±n/a nM
Citation Kim, MHKim, MYu, HKim, HYoo, KHSim, THah, JM Structure based design and syntheses of amino-1H-pyrazole amide derivatives as selective Raf kinase inhibitors in melanoma cells. Bioorg Med Chem19:1915-23 (2011) 
 
RAF proto-oncogene serine/threonine-protein kinase
Name:RAF proto-oncogene serine/threonine-protein kinase
Type:Serine/threonine-protein kinase
Mol. Mass.:73082.52
Organism:Homo sapiens (Human)
Description:P04049
Residue:648
BDBM50338874
NameBDBM50338874
Synonyms:CHEMBL1684784 | N-(5-Amino-1-(4-methoxybenzyl)-1H-pyrazol-4-yl)-2-methyl-5-(3-(trifluoromethyl)benzamido)benzamide
TypeSmall organic molecule
Emp. Form.C27H24F3N5O3
Mol. Mass.523.5064
SMILESCOc1ccc(Cn2ncc(NC(=O)c3cc(NC(=O)c4cccc(c4)C(F)(F)F)ccc3C)c2N)cc1