Reaction Details
TargetMacrophage-stimulating protein receptor
LigandBDBM50338873
Substrate/Competitorn/a
Meas. Tech.ChEMBL_727280 (CHEMBL1687374)
IC50 277.1±n/a nM
Citation Kim, MHKim, MYu, HKim, HYoo, KHSim, THah, JM Structure based design and syntheses of amino-1H-pyrazole amide derivatives as selective Raf kinase inhibitors in melanoma cells. Bioorg Med Chem19:1915-23 (2011) 
 
Macrophage-stimulating protein receptor
Name:Macrophage-stimulating protein receptor
Type:Protein
Mol. Mass.:152270.76
Organism:Homo sapiens (Human)
Description:Q04912
Residue:1400
BDBM50338873
NameBDBM50338873
Synonyms:CHEMBL1684800 | N-(5-Amino-1-(4-methoxybenzyl)-1H-pyrazol-4-yl)-5-(3-(4-chloro-3-(trifluoromethyl)phenyl)ureido)-2-methylbenzamide
TypeSmall organic molecule
Emp. Form.C27H24ClF3N6O3
Mol. Mass.572.966
SMILESCOc1ccc(Cn2ncc(NC(=O)c3cc(NC(=O)Nc4ccc(Cl)c(c4)C(F)(F)F)ccc3C)c2N)cc1