Reaction Details
TargetMitogen-activated protein kinase 8
LigandBDBM50338873
Substrate/Competitorn/a
Meas. Tech.ChEMBL_727286 (CHEMBL1687380)
IC50 1592±n/a nM
Citation Kim, MHKim, MYu, HKim, HYoo, KHSim, THah, JM Structure based design and syntheses of amino-1H-pyrazole amide derivatives as selective Raf kinase inhibitors in melanoma cells. Bioorg Med Chem19:1915-23 (2011) 
 
Mitogen-activated protein kinase 8
Name:Mitogen-activated protein kinase 8
Type:Enzyme
Mol. Mass.:48297.57
Organism:Homo sapiens (Human)
Description:JNK-1 was purchased from Upstate Cell Signaling Solutions (formerly Upstate Biotechnology).
Residue:427
BDBM50338873
NameBDBM50338873
Synonyms:CHEMBL1684800 | N-(5-Amino-1-(4-methoxybenzyl)-1H-pyrazol-4-yl)-5-(3-(4-chloro-3-(trifluoromethyl)phenyl)ureido)-2-methylbenzamide
TypeSmall organic molecule
Emp. Form.C27H24ClF3N6O3
Mol. Mass.572.966
SMILESCOc1ccc(Cn2ncc(NC(=O)c3cc(NC(=O)Nc4ccc(Cl)c(c4)C(F)(F)F)ccc3C)c2N)cc1