Reaction Details
TargetPleiotropic ABC efflux transporter of multiple drugs
LigandBDBM50339133
Substrate/Competitorn/a
Meas. Tech.ChEMBL_730212 (CHEMBL1696307)
IC50 3100±n/a nM
Citation Kolaczkowski, MKolaczkowska, AMotohashi, NMichalak, K New high-throughput screening assay to reveal similarities and differences in inhibitory sensitivities of multidrug ATP-binding cassette transporters. Antimicrob Agents Chemother53:1516-27 (2009) 
 
Pleiotropic ABC efflux transporter of multiple drugs
Name:Pleiotropic ABC efflux transporter of multiple drugs
Type:PROTEIN
Mol. Mass.:170453.87
Organism:Saccharomyces cerevisiae S288c
Description:ChEMBL_730212
Residue:1511
BDBM50339133
NameBDBM50339133
Synonyms:4-(10H-phenothiazin-10-yl)butan-1-amine | CHEMBL1688550
TypeSmall organic molecule
Emp. Form.C16H18N2S
Mol. Mass.270.393
SMILESNCCCCN1c2ccccc2Sc2ccccc12