Reaction Details
TargetPleiotropic ABC efflux transporter of multiple drugs
LigandBDBM50240514
Substrate/Competitorn/a
Meas. Tech.ChEMBL_730212 (CHEMBL1696307)
IC50 5100±n/a nM
Citation Kolaczkowski, MKolaczkowska, AMotohashi, NMichalak, K New high-throughput screening assay to reveal similarities and differences in inhibitory sensitivities of multidrug ATP-binding cassette transporters. Antimicrob Agents Chemother53:1516-27 (2009) 
 
Pleiotropic ABC efflux transporter of multiple drugs
Name:Pleiotropic ABC efflux transporter of multiple drugs
Type:PROTEIN
Mol. Mass.:170453.87
Organism:Saccharomyces cerevisiae S288c
Description:ChEMBL_730212
Residue:1511
BDBM50240514
NameBDBM50240514
Synonyms:(3Z)-3-(2-chloro-9H-thioxanthen-9-ylidene)-N,N-dimethylpropan-1-amine (Z)-chlorprothixene CHLORPROTHIXENE | cis-2-Chloro-9-(3-dimethylaminopropylidene)thioxanthene
TypeSmall organic molecule
Emp. Form.C18H18ClNS
Mol. Mass.315.86
SMILESCN(C)CC\C=C1\c2ccccc2Sc2ccc(Cl)cc12