Reaction Details
TargetMannosyl-oligosaccharide alpha-1,2-mannosidase IA
LigandBDBM50078117
Substrate/Competitorn/a
Meas. Tech.ChEMBL_736246 (CHEMBL1693390)
IC50 150±n/a nM
Citation Poláková, MŠeták, SLattová, EPetruš, LMucha, JTvaroška, IKóna, J a-D-mannose derivatives as models designed for selective inhibition of Golgia-mannosidase II. Eur J Med Chem46:944-52 (2011) 
 
Mannosyl-oligosaccharide alpha-1,2-mannosidase IA
Name:Mannosyl-oligosaccharide alpha-1,2-mannosidase IA
Type:PROTEIN
Mol. Mass.:74961.37
Organism:Drosophila melanogaster
Description:ChEMBL_103952
Residue:667
BDBM50078117
NameBDBM50078117
Synonyms:(1R,2R,3R,4S,5R)-4-AMINO-5-(METHYLTHIO)CYCLOPENTANE-1,2,3-TRIOL CHEMBL9623 Mannostatin A, 1a
TypeSmall organic molecule
Emp. Form.C6H13NO3S
Mol. Mass.179.237
SMILESCS[C@@H]1[C@@H](N)[C@@H](O)[C@@H](O)[C@H]1O