Reaction Details
TargetDelta-type opioid receptor
LigandBDBM50341289
Substrate/Competitorn/a
Meas. Tech.ChEMBL_742587 (CHEMBL1769430)
Ki 79±n/a nM
Citation Zhang, TYan, ZSromek, AKnapp, BIScrimale, TBidlack, JMNeumeyer, JL Aminothiazolomorphinans with mixed¿ andµ opioid activity. J Med Chem54:1903-13 (2011) 
 
Delta-type opioid receptor
Name:Delta-type opioid receptor
Type:G Protein-Coupled Receptor (GPCR)
Mol. Mass.:40382.98
Organism:Homo sapiens (Human)
Description:Competition binding assays were carried out using membrane preparations from transfected HN9.10 cells that constitutively expressed the delta opioid receptor.
Residue:372
BDBM50341289
NameBDBM50341289
Synonyms:CHEMBL1766027 | N'-Propyl-aminothiazolo[5,4-b]-N-cyclopropylmethylmorphinan
TypeSmall organic molecule
Emp. Form.C24H33N3S
Mol. Mass.395.604
SMILESCCCNc1nc2cc3c(C[C@@H]4[C@@H]5CCCC[C@]35CCN4CC3CC3)cc2s1