Reaction Details
TargetKappa-type opioid receptor
LigandBDBM50341288
Substrate/Competitorn/a
Meas. Tech.ChEMBL_742583 (CHEMBL1769426)
Ki 0.840000±n/a nM
Citation Zhang, TYan, ZSromek, AKnapp, BIScrimale, TBidlack, JMNeumeyer, JL Aminothiazolomorphinans with mixed¿ andµ opioid activity. J Med Chem54:1903-13 (2011) 
 
Kappa-type opioid receptor
Name:Kappa-type opioid receptor
Type:G Protein-Coupled Receptor (GPCR)
Mol. Mass.:42648.76
Organism:Homo sapiens (Human)
Description:P41145
Residue:380
BDBM50341288
NameBDBM50341288
Synonyms:CHEMBL1766026 | N'-Trifluoroethyl-aminothiazolo[5,4-b]-N-cyclopropylmethyl-morphinan
TypeSmall organic molecule
Emp. Form.C23H28F3N3S
Mol. Mass.435.549
SMILESFC(F)(F)CNc1nc2cc3c(C[C@@H]4[C@@H]5CCCC[C@]35CCN4CC3CC3)cc2s1