Reaction Details
TargetDelta-type opioid receptor
LigandBDBM50341294
Substrate/Competitorn/a
Meas. Tech.ChEMBL_742587 (CHEMBL1769430)
Ki 29±n/a nM
Citation Zhang, TYan, ZSromek, AKnapp, BIScrimale, TBidlack, JMNeumeyer, JL Aminothiazolomorphinans with mixed¿ andµ opioid activity. J Med Chem54:1903-13 (2011) 
 
Delta-type opioid receptor
Name:Delta-type opioid receptor
Type:G Protein-Coupled Receptor (GPCR)
Mol. Mass.:40382.98
Organism:Homo sapiens (Human)
Description:Competition binding assays were carried out using membrane preparations from transfected HN9.10 cells that constitutively expressed the delta opioid receptor.
Residue:372
BDBM50341294
NameBDBM50341294
Synonyms:CHEMBL1766032 | N'-(3-Hydroxybenzyl)-aminothiazolo[5,4-b]-N-cyclopropylmethyl-morphinan
TypeSmall organic molecule
Emp. Form.C28H33N3OS
Mol. Mass.459.646
SMILESOc1cccc(CNc2nc3cc4c(C[C@@H]5[C@@H]6CCCC[C@]46CCN5CC4CC4)cc3s2)c1