Reaction Details
TargetMu-type opioid receptor
LigandBDBM50341291
Substrate/Competitorn/a
Meas. Tech.ChEMBL_742590 (CHEMBL1769433)
Ki 180±n/a nM
Citation Zhang, TYan, ZSromek, AKnapp, BIScrimale, TBidlack, JMNeumeyer, JL Aminothiazolomorphinans with mixed¿ andµ opioid activity. J Med Chem54:1903-13 (2011) 
 
Mu-type opioid receptor
Name:Mu-type opioid receptor
Type:G Protein-Coupled Receptor (GPCR)
Mol. Mass.:44789.51
Organism:Homo sapiens (Human)
Description:P35372
Residue:400
BDBM50341291
NameBDBM50341291
Synonyms:CHEMBL1766029 | N'-Phenyl-aminothiazolo[5,4-b]-N-cyclopropylmethylmorphinan
TypeSmall organic molecule
Emp. Form.C27H31N3S
Mol. Mass.429.62
SMILESC(C1CC1)N1CC[C@]23CCCC[C@H]2[C@H]1Cc1cc2sc(Nc4ccccc4)nc2cc31