Reaction Details
TargetMu-type opioid receptor
LigandBDBM50341285
Substrate/Competitorn/a
Meas. Tech.ChEMBL_742590 (CHEMBL1769433)
EC50 71±n/a nM
Citation Zhang, TYan, ZSromek, AKnapp, BIScrimale, TBidlack, JMNeumeyer, JL Aminothiazolomorphinans with mixed¿ andµ opioid activity. J Med Chem54:1903-13 (2011) 
 
Mu-type opioid receptor
Name:Mu-type opioid receptor
Type:G Protein-Coupled Receptor (GPCR)
Mol. Mass.:44789.51
Organism:Homo sapiens (Human)
Description:P35372
Residue:400
BDBM50341285
NameBDBM50341285
Synonyms:Aminothiazolo[5,4-b]-N-(S)-tetrahydrofurylmethylmorphinan | CHEMBL1766023
TypeSmall organic molecule
Emp. Form.C22H29N3OS
Mol. Mass.383.55
SMILESNc1nc2cc3c(C[C@@H]4[C@@H]5CCCC[C@]35CCN4C[C@@H]3CCCO3)cc2s1