Reaction Details
TargetMu-type opioid receptor
LigandBDBM50210551
Substrate/Competitorn/a
Meas. Tech.ChEMBL_742590 (CHEMBL1769433)
Ki 150±n/a nM
Citation Zhang, TYan, ZSromek, AKnapp, BIScrimale, TBidlack, JMNeumeyer, JL Aminothiazolomorphinans with mixed¿ andµ opioid activity. J Med Chem54:1903-13 (2011) 
 
Mu-type opioid receptor
Name:Mu-type opioid receptor
Type:G Protein-Coupled Receptor (GPCR)
Mol. Mass.:44789.51
Organism:Homo sapiens (Human)
Description:P35372
Residue:400
BDBM50210551
NameBDBM50210551
Synonyms:2'-amino oxazole[5,4-b]-N-cyclopropylmethylmorphinan | CHEMBL390911
TypeSmall organic molecule
Emp. Form.C21H27N3O
Mol. Mass.337.4586
SMILESNc1nc2cc3C[C@@H]4[C@@H]5CCCC[C@]5(CCN4CC4CC4)c3cc2o1