Reaction Details
TargetMu-type opioid receptor
LigandBDBM50341308
Substrate/Competitorn/a
Meas. Tech.ChEMBL_742590 (CHEMBL1769433)
Ki 1.1±n/a nM
Citation Zhang, TYan, ZSromek, AKnapp, BIScrimale, TBidlack, JMNeumeyer, JL Aminothiazolomorphinans with mixed¿ andµ opioid activity. J Med Chem54:1903-13 (2011) 
 
Mu-type opioid receptor
Name:Mu-type opioid receptor
Type:G Protein-Coupled Receptor (GPCR)
Mol. Mass.:44789.51
Organism:Homo sapiens (Human)
Description:P35372
Residue:400
BDBM50341308
NameBDBM50341308
Synonyms:CHEMBL1766021 US10766864, Example 115
TypeSmall organic molecule
Emp. Form.C18H23N3S
Mol. Mass.313.46
SMILESCN1CC[C@]23CCCC[C@H]2[C@H]1Cc1cc2sc(N)nc2cc31