Reaction Details
TargetcAMP-dependent protein kinase catalytic subunit beta
LigandBDBM50342212
Substrate/Competitorn/a
Meas. Tech.ChEMBL_743045 (CHEMBL1768516)
IC50 23550±n/a nM
Citation Djung, JFMears, RJMontalbetti, CACoulter, TSGolebiowski, ACarr, ANBarker, OGreis, KDZhou, SDolan, EDavis, GF The synthesis and evaluation of indolylureas as PKCa inhibitors. Bioorg Med Chem19:2742-50 (2011) 
 
cAMP-dependent protein kinase catalytic subunit beta
Name:cAMP-dependent protein kinase catalytic subunit beta
Type:PROTEIN
Mol. Mass.:40631.25
Organism:Homo sapiens (Human)
Description:ChEMBL_586348
Residue:351
BDBM50342212
NameBDBM50342212
Synonyms:1-[1-(3-Dimethylaminopropyl)-1H-indol-3-yl]-3-(4-phenylpyrimidin-2-yl)urea | CHEMBL1766422
TypeSmall organic molecule
Emp. Form.C24H26N6O
Mol. Mass.414.5028
SMILESCN(C)CCCn1cc(NC(=O)Nc2nccc(n2)-c2ccccc2)c2ccccc12