Reaction Details
TargetCalmodulin-domain protein kinase 1
LigandBDBM50345740
Substrate/Competitorn/a
Meas. Tech.ChEMBL_750529 (CHEMBL1786290)
IC50 5±n/a nM
Citation Murphy, RCOjo, KKLarson, ETCastellanos-Gonzalez, APerera, BGKeyloun, KRKim, JEBhandari, JGMuller, NRVerlinde, CLWhite, ACMerritt, EAVan Voorhis, WCMaly, DJ Discovery of Potent and Selective Inhibitors of Calcium-Dependent Protein Kinase 1 (CDPK1) from C. parvum and T. gondii. ACS Med Chem Lett1:331-335 (2011) 
 
Calmodulin-domain protein kinase 1
Name:Calmodulin-domain protein kinase 1
Type:Enzyme Catalytic Domain
Mol. Mass.:57248.42
Organism:Toxoplasma gondii
Description:n/a
Residue:507
BDBM50345740
NameBDBM50345740
Synonyms:3-(6-ethoxynaphthalen-2-yl)-1-isopropyl-1H-pyrazolo[3,4-d]pyrimidin-4-amine CHEMBL2070048 US11247972, Compound 7r | US9765037, Compound 7r
TypeSmall organic molecule
Emp. Form.C20H21N5O
Mol. Mass.347.4136
SMILESCCOc1ccc2cc(ccc2c1)-c1nn(C(C)C)c2ncnc(N)c12