Reaction Details
TargetMast/stem cell growth factor receptor Kit
LigandBDBM26474
Substrate/Competitorn/a
Meas. Tech.ChEMBL_750108 (CHEMBL1787525)
Kd 2.8±n/a nM
Citation Shallal, HMRussu, WA Discovery, synthesis, and investigation of the antitumor activity of novel piperazinylpyrimidine derivatives. Eur J Med Chem46:2043-57 (2011) 
 
Mast/stem cell growth factor receptor Kit
Name:Mast/stem cell growth factor receptor Kit
Type:Protein
Mol. Mass.:109869.37
Organism:Homo sapiens (Human)
Description:P10721
Residue:976
BDBM26474
NameBDBM26474
Synonyms:5-({4-[(2,3-dimethyl-2H-indazol-6-yl)(methyl)amino]pyrimidin-2-yl}amino)-2-methylbenzene-1-sulfonamide JMC514632 Compound 13 cid_10113978
TypeSmall organic molecule
Emp. Form.C21H23N7O2S
Mol. Mass.437.518
SMILESCN(c1ccc2c(C)n(C)nc2c1)c1ccnc(Nc2ccc(C)c(c2)S(N)(=O)=O)n1