Reaction Details
TargetDelta-type opioid receptor
LigandBDBM50346952
Substrate/Competitorn/a
Meas. Tech.ChEMBL_753175 (CHEMBL1799268)
Ki 2.6±n/a nM
Citation Majumdar, SBurgman, MHaselton, NGrinnell, SOcampo, JPasternak, ARPasternak, GW Generation of novel radiolabeled opiates through site-selective iodination. Bioorg Med Chem Lett21:4001-4 (2011) 
 
Delta-type opioid receptor
Name:Delta-type opioid receptor
Type:G Protein-Coupled Receptor (GPCR)
Mol. Mass.:40382.98
Organism:Homo sapiens (Human)
Description:Competition binding assays were carried out using membrane preparations from transfected HN9.10 cells that constitutively expressed the delta opioid receptor.
Residue:372
BDBM50346952
NameBDBM50346952
Synonyms:CHEMBL1795712 | CHEMBL1795715
TypeSmall organic molecule
Emp. Form.C26H27IN2O4
Mol. Mass.558.4081
SMILESOc1ccc2C[C@H]3N(CC=C)CC[C@@]45[C@@H](Oc1c24)[C@@H](CC[C@@]35O)NC(=O)c1cccc(I)c1