Reaction Details
TargetMu-type opioid receptor
LigandBDBM50346951
Substrate/Competitorn/a
Meas. Tech.ChEMBL_753173 (CHEMBL1799266)
Ki 2.5±n/a nM
Citation Majumdar, SBurgman, MHaselton, NGrinnell, SOcampo, JPasternak, ARPasternak, GW Generation of novel radiolabeled opiates through site-selective iodination. Bioorg Med Chem Lett21:4001-4 (2011) 
 
Mu-type opioid receptor
Name:Mu-type opioid receptor
Type:G Protein-Coupled Receptor (GPCR)
Mol. Mass.:44789.51
Organism:Homo sapiens (Human)
Description:P35372
Residue:400
BDBM50346951
NameBDBM50346951
Synonyms:CHEMBL1795711 | CHEMBL1795714
TypeSmall organic molecule
Emp. Form.C27H29IN2O4
Mol. Mass.572.4346
SMILESOc1ccc2C[C@H]3N(CC4CC4)CC[C@@]45[C@@H](Oc1c24)[C@@H](CC[C@@]35O)NC(=O)c1cccc(I)c1