Reaction Details
TargetMitogen-activated protein kinase 14
LigandBDBM50348322
Substrate/Competitorn/a
Meas. Tech.ChEMBL_757551 (CHEMBL1804666)
IC50 2±n/a nM
Citation Eastwood, PGonzález, JGómez, EVidal, BCaturla, FRoca, RBalagué, COrellana, ADomínguez, M Indolin-2-one p38a inhibitors I: design, profiling and crystallographic binding mode. Bioorg Med Chem Lett21:4130-3 (2011) 
 
Mitogen-activated protein kinase 14
Name:Mitogen-activated protein kinase 14
Type:Serine/threonine-protein kinase
Mol. Mass.:41286.76
Organism:Homo sapiens (Human)
Description:Q16539
Residue:360
BDBM50348322
NameBDBM50348322
Synonyms:CHEMBL1800913
TypeSmall organic molecule
Emp. Form.C22H21ClN2O2
Mol. Mass.380.867
SMILESClc1ccc(cc1-c1ccc2c(NC(=O)C22CCCC2)c1)C(=O)NC1CC1