Reaction Details
TargetMitogen-activated protein kinase 14
LigandBDBM50348323
Substrate/Competitorn/a
Meas. Tech.ChEMBL_757551 (CHEMBL1804666)
IC50 0.9±n/a nM
Citation Eastwood, PGonzález, JGómez, EVidal, BCaturla, FRoca, RBalagué, COrellana, ADomínguez, M Indolin-2-one p38a inhibitors I: design, profiling and crystallographic binding mode. Bioorg Med Chem Lett21:4130-3 (2011) 
 
Mitogen-activated protein kinase 14
Name:Mitogen-activated protein kinase 14
Type:Serine/threonine-protein kinase
Mol. Mass.:41286.76
Organism:Homo sapiens (Human)
Description:Q16539
Residue:360
BDBM50348323
NameBDBM50348323
Synonyms:CHEMBL1800912
TypeSmall organic molecule
Emp. Form.C24H26N2O2
Mol. Mass.374.4754
SMILESCc1ccc(cc1-c1ccc2c(NC(=O)C22CCCCC2)c1)C(=O)NC1CC1