Reaction Details
TargetAndrogen receptor
LigandBDBM50348414
Substrate/Competitorn/a
Meas. Tech.ChEMBL_754805 (CHEMBL1805660)
Ki 2341±n/a nM
Citation Yang, BVWeinstein, DSDoweyko, LMGong, HVaccaro, WHuynh, TXiao, HYDoweyko, AMMcKay, LHolloway, DASomerville, JEHabte, SCunningham, MMcMahon, MTownsend, RShuster, DDodd, JHNadler, SGBarrish, JC Dimethyl-diphenyl-propanamide Derivatives As Nonsteroidal Dissociated Glucocorticoid Receptor Agonists. J Med Chem53:8241-51 (2010) 
 
Androgen receptor
Name:Androgen receptor
Type:Receptor
Mol. Mass.:99185.27
Organism:Homo sapiens (Human)
Description:CHO cells were stably transfected with human AR gene.
Residue:920
BDBM50348414
NameBDBM50348414
Synonyms:CHEMBL1800984
TypeSmall organic molecule
Emp. Form.C20H18N2O3S
Mol. Mass.366.434
SMILESCC(C)([C@H]1c2ccccc2Oc2cc(O)ccc12)C(=O)Nc1nccs1