Reaction Details
TargetAndrogen receptor
LigandBDBM50348415
Substrate/Competitorn/a
Meas. Tech.ChEMBL_754805 (CHEMBL1805660)
Ki 696±n/a nM
Citation Yang, BVWeinstein, DSDoweyko, LMGong, HVaccaro, WHuynh, TXiao, HYDoweyko, AMMcKay, LHolloway, DASomerville, JEHabte, SCunningham, MMcMahon, MTownsend, RShuster, DDodd, JHNadler, SGBarrish, JC Dimethyl-diphenyl-propanamide Derivatives As Nonsteroidal Dissociated Glucocorticoid Receptor Agonists. J Med Chem53:8241-51 (2010) 
 
Androgen receptor
Name:Androgen receptor
Type:Receptor
Mol. Mass.:99185.27
Organism:Homo sapiens (Human)
Description:CHO cells were stably transfected with human AR gene.
Residue:920
BDBM50348415
NameBDBM50348415
Synonyms:CHEMBL1800985
TypeSmall organic molecule
Emp. Form.C19H17N3O3S
Mol. Mass.367.422
SMILESCC(C)([C@H]1c2ccccc2Oc2cc(O)ccc12)C(=O)Nc1nncs1