Reaction Details
TargetEstrogen receptor
LigandBDBM50348401
Substrate/Competitorn/a
Meas. Tech.ChEMBL_754803 (CHEMBL1805658)
Ki>100000±n/a nM
Citation Yang, BVWeinstein, DSDoweyko, LMGong, HVaccaro, WHuynh, TXiao, HYDoweyko, AMMcKay, LHolloway, DASomerville, JEHabte, SCunningham, MMcMahon, MTownsend, RShuster, DDodd, JHNadler, SGBarrish, JC Dimethyl-diphenyl-propanamide Derivatives As Nonsteroidal Dissociated Glucocorticoid Receptor Agonists. J Med Chem53:8241-51 (2010) 
 
Estrogen receptor
Name:Estrogen receptor
Type:Protein
Mol. Mass.:66230.44
Organism:Homo sapiens (Human)
Description:P03372
Residue:595
BDBM50348401
NameBDBM50348401
Synonyms:CHEMBL1801012
TypeSmall organic molecule
Emp. Form.C20H20N2O2S
Mol. Mass.352.45
SMILESCC(C)([C@@H](c1ccccc1)c1ccc(O)cc1)C(=O)Nc1nccs1