Reaction Details
TargetEstrogen receptor
LigandBDBM50348414
Substrate/Competitorn/a
Meas. Tech.ChEMBL_754803 (CHEMBL1805658)
Ki 2300±n/a nM
Citation Yang, BVWeinstein, DSDoweyko, LMGong, HVaccaro, WHuynh, TXiao, HYDoweyko, AMMcKay, LHolloway, DASomerville, JEHabte, SCunningham, MMcMahon, MTownsend, RShuster, DDodd, JHNadler, SGBarrish, JC Dimethyl-diphenyl-propanamide Derivatives As Nonsteroidal Dissociated Glucocorticoid Receptor Agonists. J Med Chem53:8241-51 (2010) 
 
Estrogen receptor
Name:Estrogen receptor
Type:Protein
Mol. Mass.:66230.44
Organism:Homo sapiens (Human)
Description:P03372
Residue:595
BDBM50348414
NameBDBM50348414
Synonyms:CHEMBL1800984
TypeSmall organic molecule
Emp. Form.C20H18N2O3S
Mol. Mass.366.434
SMILESCC(C)([C@H]1c2ccccc2Oc2cc(O)ccc12)C(=O)Nc1nccs1