Reaction Details
TargetEstrogen receptor
LigandBDBM50348415
Substrate/Competitorn/a
Meas. Tech.ChEMBL_754803 (CHEMBL1805658)
Ki 5500±n/a nM
Citation Yang, BVWeinstein, DSDoweyko, LMGong, HVaccaro, WHuynh, TXiao, HYDoweyko, AMMcKay, LHolloway, DASomerville, JEHabte, SCunningham, MMcMahon, MTownsend, RShuster, DDodd, JHNadler, SGBarrish, JC Dimethyl-diphenyl-propanamide Derivatives As Nonsteroidal Dissociated Glucocorticoid Receptor Agonists. J Med Chem53:8241-51 (2010) 
 
Estrogen receptor
Name:Estrogen receptor
Type:Protein
Mol. Mass.:66230.44
Organism:Homo sapiens (Human)
Description:P03372
Residue:595
BDBM50348415
NameBDBM50348415
Synonyms:CHEMBL1800985
TypeSmall organic molecule
Emp. Form.C19H17N3O3S
Mol. Mass.367.422
SMILESCC(C)([C@H]1c2ccccc2Oc2cc(O)ccc12)C(=O)Nc1nncs1